BDBM50288656 (Phenyl-m-tolyl-methyl)-phosphonic acid::CHEMBL71259
SMILES Cc1cccc(c1)C(c1ccccc1)P(O)(O)=O
InChI Key InChIKey=FRNYNANUHYKUCW-UHFFFAOYSA-N
Data  2 IC50
  Tab Delimited (TSV)   2D SDfile   Computed 3D by Vconf -m prep SDfile
Find this compound or compounds like it in BindingDB:
Activity Spreadsheet -- Enzyme Inhibition Constant Data from BindingDB
Found 2 hits for monomerid = 50288656
TargetProstatic acid phosphatase(Homo sapiens (Human))
TBA
Curated by ChEMBL
LigandPNGBDBM50288656((Phenyl-m-tolyl-methyl)-phosphonic acid | CHEMBL71...)
Affinity DataIC50:  1.40E+4nM. Assay description: Compound was tested for its inhibitory activity against human prostatic acid phosphatase
In DepthDetails Article
TargetProstatic acid phosphatase(Homo sapiens (Human))
TBA
Curated by ChEMBL
LigandPNGBDBM50288656((Phenyl-m-tolyl-methyl)-phosphonic acid | CHEMBL71...)
Affinity DataIC50:  1.40E+4nM. Assay description: Inhibition of human prostatic acid phosphatase was determined as inhibition of the hydrolysis of tyrosine phosphate
In DepthDetails Article