BDBM50288777 CHEMBL135894::[(1R,2S)-2-(2-Methoxy-phenyl)-cyclopropylmethyl]-dipropyl-amine
SMILES CCCN(CCC)C[C@@H]1C[C@@H]1c1ccccc1OC
InChI Key InChIKey=WHVTYDOFJSSONC-HOCLYGCPSA-N
Data  1 KI
  Tab Delimited (TSV)   2D SDfile   Computed 3D by Vconf -m prep SDfile
Find this compound or compounds like it in BindingDB:
Activity Spreadsheet -- Enzyme Inhibition Constant Data from BindingDB
Found 1 hit for monomerid = 50288777
Target5-hydroxytryptamine receptor 5A(RAT)
TBA
Curated by ChEMBL
LigandPNGBDBM50288777(CHEMBL135894 | [(1R,2S)-2-(2-Methoxy-phenyl)-cyclo...)
Affinity DataKi:  998nM. Assay description: Inhibition of specific [3H]-OH-DPAT binding at 5-hydroxytryptamine 1A receptor in rat hippocampal membranes
In DepthDetails Article