BDBM50288811 4-Amino-N-{(1S,2R)-1-benzyl-2-hydroxy-3-[isobutyl-(4-methoxy-benzenesulfonyl)-amino]-propyl}-2-methyl-benzamide::CHEMBL342037
SMILES COc1ccc(cc1)S(=O)(=O)N(CC(C)C)C[C@@H](O)[C@H](Cc1ccccc1)NC(=O)c1ccc(N)cc1C
InChI Key InChIKey=CTBOWFKHDQNIRW-WUFINQPMSA-N
Data  1 IC50
  Tab Delimited (TSV)   2D SDfile   Computed 3D by Vconf -m prep SDfile
Find this compound or compounds like it in BindingDB:
Activity Spreadsheet -- Enzyme Inhibition Constant Data from BindingDB
Found 1 hit for monomerid = 50288811
TargetGag-Pol polyprotein [489-587](Human immunodeficiency virus type 1)
TBA
Curated by ChEMBL
LigandPNGBDBM50288811(4-Amino-N-{(1S,2R)-1-benzyl-2-hydroxy-3-[isobutyl-...)
Affinity DataIC50:  9nM. Assay description: Inhibitory activity of the compound was evaluated against recombinant HIV-1 protease using spectrofluorometric assay
In DepthDetails Article