BDBM50289073 4-[4-Hydroxy-5-(2-isopropyl-phenylsulfanyl)-6-oxo-2-phenyl-3,6-dihydro-2H-pyran-2-yl]-N-phenethyl-butyramide::CHEMBL163390
SMILES CC(C)c1ccccc1SC1C(=O)CC(CCCC(=O)NCCc2ccccc2)(OC1=O)c1ccccc1
InChI Key InChIKey=LDFITYITWZCKOP-UHFFFAOYSA-N
Data  1 IC50
  Tab Delimited (TSV)   2D SDfile   Computed 3D by Vconf -m prep SDfile
Find this compound or compounds like it in BindingDB:
Activity Spreadsheet -- Enzyme Inhibition Constant Data from BindingDB
Found 1 hit for monomerid = 50289073
TargetGag-Pol polyprotein [489-587](Human immunodeficiency virus type 1)
TBA
Curated by ChEMBL
LigandPNGBDBM50289073(4-[4-Hydroxy-5-(2-isopropyl-phenylsulfanyl)-6-oxo-...)
Affinity DataIC50:  146nMpH: 4.7Assay Description:In vitro inhibitory activity against purified HIV-1 protease at a pH of 4.7 and a final enzyme concentration of 0.45-1.1 nM
In DepthDetails Article