BDBM50289364 2,3-Dimethyl-8-phenyl-6H-imidazo[1,2-d][1,2,4]triazin-5-one::CHEMBL368198
SMILES Cc1nc2c(n[nH]c(=O)n2c1C)-c1ccccc1
InChI Key InChIKey=SIWWEAZSQYOHDY-UHFFFAOYSA-N
Data  3 IC50
  Tab Delimited (TSV)   2D SDfile   Computed 3D by Vconf -m prep SDfile
Find this compound or compounds like it in BindingDB:
Activity Spreadsheet -- Enzyme Inhibition Constant Data from BindingDB
Found 3 hits for monomerid = 50289364
TargetcGMP-specific 3',5'-cyclic phosphodiesterase(Homo sapiens (Human))
TBA
Curated by ChEMBL
LigandPNGBDBM50289364(2,3-Dimethyl-8-phenyl-6H-imidazo[1,2-d][1,2,4]tria...)
Affinity DataIC50:  2.27E+4nM. Assay description: In vitro inhibition of phosphodiesterase (PDE V).
In DepthDetails Article
TargetcGMP-inhibited 3',5'-cyclic phosphodiesterase 3A/3B(Homo sapiens (Human))
TBA
Curated by ChEMBL
LigandPNGBDBM50289364(2,3-Dimethyl-8-phenyl-6H-imidazo[1,2-d][1,2,4]tria...)
Affinity DataIC50:  2.10E+3nM. Assay description: In vitro inhibition of phosphodiesterase (PDE III).
In DepthDetails Article
LigandPNGBDBM50289364(2,3-Dimethyl-8-phenyl-6H-imidazo[1,2-d][1,2,4]tria...)
Affinity DataIC50:  3.50E+3nM. Assay description: In vitro inhibition of phosphodiesterase (PDE I).
In DepthDetails Article