BDBM50289469 8-(2,2,2-Trifluoro-acetyl)-naphthalene-2-carboxylic acid::CHEMBL33408
SMILES OC(=O)c1ccc2cccc(C(=O)C(F)(F)F)c2c1
InChI Key InChIKey=ASJPCQMGGRJUPD-UHFFFAOYSA-N
Data  1 IC50
  Tab Delimited (TSV)   2D SDfile   Computed 3D by Vconf -m prep SDfile
Find this compound or compounds like it in BindingDB:
Activity Spreadsheet -- Enzyme Inhibition Constant Data from BindingDB
Found 1 hit for monomerid = 50289469
TargetGroup IID secretory phospholipase A2(Homo sapiens (Human))
TBA
Curated by ChEMBL
LigandPNGBDBM50289469(8-(2,2,2-Trifluoro-acetyl)-naphthalene-2-carboxyli...)
Affinity DataIC50:  2.40E+3nM. Assay description: Compound was measured for the inhibitory activity against Secretory phospholipase A 2 (s-PLA2)
In DepthDetails Article