BDBM50289536 1-Benzyl-3-((E)-styryl)-piperidine::CHEMBL39855
SMILES C(N1CCCC(C1)\C=C\c1ccccc1)c1ccccc1
InChI Key InChIKey=XNGPUVPUZLDVPO-BUHFOSPRSA-N
Data  1 IC50
  Tab Delimited (TSV)   2D SDfile   Computed 3D by Vconf -m prep SDfile
Find this compound or compounds like it in BindingDB:
Activity Spreadsheet -- Enzyme Inhibition Constant Data from BindingDB
Found 1 hit for monomerid = 50289536
LigandPNGBDBM50289536(1-Benzyl-3-((E)-styryl)-piperidine | CHEMBL39855)
Affinity DataIC50:  10nM. Assay description: Binding affinity at sigma receptor by [3H]-(+)-SKF-10,047 displacement.
In DepthDetails Article