BDBM50289649 CHEMBL429908::linear peptide of RES-701-1
SMILES C[C@@H](O)[C@H](NC(=O)CNC(=O)[C@H](Cc1cnc[nH]1)NC(=O)[C@H](Cc1c[nH]c2ccccc12)NC(=O)[C@H](CC(N)=O)NC(=O)CN)C(=O)N[C@@H](C)C(=O)N1CCC[C@H]1C(=O)N[C@@H](CC(O)=O)C(=O)N[C@@H](Cc1c[nH]c2ccccc12)C(=O)N[C@@H](Cc1ccccc1)C(=O)N[C@@H](Cc1ccccc1)C(=O)N[C@@H](CC(N)=O)C(=O)N[C@@H](Cc1ccc(O)cc1)C(=O)N[C@@H](Cc1ccc(O)cc1)C(=O)N[C@@H](Cc1c[nH]c2ccccc12)C(O)=O
InChI Key InChIKey=ZUENRBCVCNXGQC-RYIFUXPHSA-N
Data  1 IC50
  Tab Delimited (TSV)   2D SDfile   Computed 3D by Vconf -m prep SDfile
Find this compound or compounds like it in BindingDB:
Activity Spreadsheet -- Enzyme Inhibition Constant Data from BindingDB
Found 1 hit for monomerid = 50289649
TargetEndothelin receptor type B(Bos taurus)
TBA
Curated by ChEMBL
LigandPNGBDBM50289649(CHEMBL429908 | linear peptide of RES-701-1)
Affinity DataIC50:  5.00E+3nM. Assay description: Binding activity to ET-B receptor on bovine cerebellum membrane
In DepthDetails Article