BDBM50290336 Acetic acid acetoxy-[1-(4-fluoro-phenyl)-7-naphthalen-1-ylmethyl-4,5,6,7-tetrahydro-1H-indazol-3-yl]-methyl ester::CHEMBL315991
SMILES CC(=O)OC(OC(C)=O)c1nn(c2C(Cc3cccc4ccccc34)CCCc12)-c1ccc(F)cc1
InChI Key InChIKey=OLEKFRBBSDIQAW-UHFFFAOYSA-N
Data  1 IC50
  Tab Delimited (TSV)   2D SDfile   Computed 3D by Vconf -m prep SDfile
Find this compound or compounds like it in BindingDB:
Activity Spreadsheet -- Enzyme Inhibition Constant Data from BindingDB
Found 1 hit for monomerid = 50290336
TargetProgesterone receptor(Oryctolagus cuniculus)
TBA
Curated by ChEMBL
LigandPNGBDBM50290336(Acetic acid acetoxy-[1-(4-fluoro-phenyl)-7-naphtha...)
Affinity DataIC50:  5.30nM. Assay description: Binding affinity determined by ability to displace [3H]-R5020 radioligand using uterine progesterone receptor obtained from estrogen-primed rabbit
In DepthDetails Article