BDBM50290359 1-(4-Fluoro-phenyl)-7-naphthalen-1-ylmethyl-4,5,6,7-tetrahydro-1H-indazole-3-carbaldehyde::CHEMBL86310
SMILES Fc1ccc(cc1)-n1nc(C=O)c2CCCC(Cc3cccc4ccccc34)c12
InChI Key InChIKey=AODALVDMGJGCNW-UHFFFAOYSA-N
Data  1 IC50
  Tab Delimited (TSV)   2D SDfile   Computed 3D by Vconf -m prep SDfile
Find this compound or compounds like it in BindingDB:
Activity Spreadsheet -- Enzyme Inhibition Constant Data from BindingDB
Found 1 hit for monomerid = 50290359
TargetProgesterone receptor(Oryctolagus cuniculus)
TBA
Curated by ChEMBL
LigandPNGBDBM50290359(1-(4-Fluoro-phenyl)-7-naphthalen-1-ylmethyl-4,5,6,...)
Affinity DataIC50:  3.20nM. Assay description: Binding affinity determined by ability to displace [3H]-R5020 radioligand using uterine progesterone receptor obtained from estrogen-primed rabbit
In DepthDetails Article