BDBM50290391 CHEMBL42531::Methyl-carbamic acid 1-[(3-fluoro-pyridin-4-yl)-propyl-amino]-3-methyl-1H-indol-5-yl ester
SMILES CCCN(c1ccncc1F)n1cc(C)c2cc(OC(=O)NC)ccc12
InChI Key InChIKey=SDDAWVZASDNIOK-UHFFFAOYSA-N
Data  2 IC50
  Tab Delimited (TSV)   2D SDfile   Computed 3D by Vconf -m prep SDfile
Find this compound or compounds like it in BindingDB:
Activity Spreadsheet -- Enzyme Inhibition Constant Data from BindingDB
Found 2 hits for monomerid = 50290391
TargetAcetylcholinesterase(Rattus norvegicus (rat))
TBA
Curated by ChEMBL
LigandPNGBDBM50290391(CHEMBL42531 | Methyl-carbamic acid 1-[(3-fluoro-py...)
Affinity DataIC50:  58nM. Assay description: Compound was evaluated in vitro in rats for the inhibition of brain (striatal) acetylcholinesterase (AChEI) using acetylthiocholine as substrate; 0.0...
In DepthDetails Article
TargetCholinesterase(Homo sapiens (Human))
TBA
Curated by ChEMBL
LigandPNGBDBM50290391(CHEMBL42531 | Methyl-carbamic acid 1-[(3-fluoro-py...)
Affinity DataIC50:  31nM. Assay description: Compound was evaluated in vitro for the inhibition of human serum Butyrylcholinesterase using butyrylthiocholine as substrate; 0.023-0.041
In DepthDetails Article