BDBM50290556 (R)-[2-(2,4-Dichloro-phenyl)-6-methoxy-quinolin-4-yl]-(5-ethyl-1-aza-bicyclo[2.2.2]oct-2-yl)-methanol::CHEMBL88582
SMILES CCC1CN2CCC1CC2[C@H](O)c1cc(nc2ccc(OC)cc12)-c1ccc(Cl)cc1Cl
InChI Key InChIKey=VVOWBIVLNVPXMD-WPAOPDMSSA-N
Data  1 IC50
  Tab Delimited (TSV)   2D SDfile   Computed 3D by Vconf -m prep SDfile
Find this compound or compounds like it in BindingDB:
Activity Spreadsheet -- Enzyme Inhibition Constant Data from BindingDB
Found 1 hit for monomerid = 50290556
TargetCalcitonin gene-related peptide type 1 receptor(Homo sapiens (Human))
TBA
Curated by ChEMBL
LigandPNGBDBM50290556((R)-[2-(2,4-Dichloro-phenyl)-6-methoxy-quinolin-4-...)
Affinity DataIC50:  3.70E+4nM. Assay description: Displacement of [125I]-hCGRP human Calcitonin gene-related peptide type receptor expressed in SK-N-MC neuroblastoma cell membranes
In DepthDetails Article