BDBM50290632 Acetic acid 7-methoxy-4-(2-phenyl-cyclopropylamino)-quinazolin-6-yl ester::CHEMBL90540
SMILES COc1cc2ncnc(NC3CC3c3ccccc3)c2cc1OC(C)=O
InChI Key InChIKey=ZXXUUYKUUAWFJM-UHFFFAOYSA-N
Data  2 IC50
  Tab Delimited (TSV)   2D SDfile   Computed 3D by Vconf -m prep SDfile
Find this compound or compounds like it in BindingDB:
Activity Spreadsheet -- Enzyme Inhibition Constant Data from BindingDB
Found 2 hits for monomerid = 50290632
TargetEpidermal growth factor receptor(Homo sapiens (Human))
TBA
Curated by ChEMBL
LigandPNGBDBM50290632(Acetic acid 7-methoxy-4-(2-phenyl-cyclopropylamino...)
Affinity DataIC50:  1.14E+4nM. Assay description: Tested for inhibition of Epidermal growth factor receptor from A431 vulval squamous carcinoma cells
In DepthDetails Article
TargetEpidermal growth factor receptor(Homo sapiens (Human))
TBA
Curated by ChEMBL
LigandPNGBDBM50290632(Acetic acid 7-methoxy-4-(2-phenyl-cyclopropylamino...)
Affinity DataIC50:  84nM. Assay description: Tested for inhibition of Epidermal growth factor receptor from A431 vulval squamous carcinoma cells
In DepthDetails Article