BDBM50290793 CHEMBL410837::Pneumocandin analogue
SMILES CCC(C)CC(C)CCCCCCCCC(=O)N[C@@H]1C[C@@H](O)CNC(=O)[C@@H]2[C@@H](O)CCN2C(=O)[C@@H](NC(=O)[C@@H](NC(=O)[C@@H]2C[C@@H](O)CN2C(=O)[C@@H](NC1=O)[C@@H](C)O)[C@@H](O)Cc1ccc(O)c(C=C)c1)[C@@H](O)CC(N)=O
InChI Key InChIKey=DEPDABZUMGIRQV-ZWCVPZMSSA-N
Data  1 IC50
  Tab Delimited (TSV)   2D SDfile   Computed 3D by Vconf -m prep SDfile
Find this compound or compounds like it in BindingDB:
Activity Spreadsheet -- Enzyme Inhibition Constant Data from BindingDB
Found 1 hit for monomerid = 50290793
Target1,3-beta-glucan synthase component GSC2(Saccharomyces cerevisiae)
TBA
Curated by ChEMBL
LigandPNGBDBM50290793(CHEMBL410837 | Pneumocandin analogue)
Affinity DataIC50:  80nM. Assay description: In vitro inhibition of 1,3-beta-glucan synthase in Candida albicans membrane assay.
In DepthDetails Article