BDBM50290875 (S)-13-Hydroxymethyl-10-((S)-isopropyl)-3,9,12-triaza-tricyclo[6.6.1.0*4,15*]pentadeca-1,4,6,8(15)-tetraen-11-one::CHEMBL100546
SMILES CC(C)[C@@H]1Nc2cccc3[nH]cc(C[C@@H](CO)NC1=O)c23
InChI Key InChIKey=AXVANMLUKNGODF-NHYWBVRUSA-N
Data  1 KI
  Tab Delimited (TSV)   2D SDfile   Computed 3D by Vconf -m prep SDfile
Find this compound or compounds like it in BindingDB:
Activity Spreadsheet -- Enzyme Inhibition Constant Data from BindingDB
Found 1 hit for monomerid = 50290875
TargetProtein kinase C delta type(Homo sapiens (Human))
TBA
Curated by ChEMBL
LigandPNGBDBM50290875((S)-13-Hydroxymethyl-10-((S)-isopropyl)-3,9,12-tri...)
Affinity DataKi:  80nM. Assay description: Displacement of [3H]-PDBu from Protein kinase C delta
In DepthDetails Article