BDBM50291025 (2R,3R,4R,5S)-2-Hydroxymethyl-1-((E)-4-trimethylsilanyl-but-3-enyl)-piperidine-3,4,5-triol::CHEMBL331723
SMILES C[Si](C)(C)\C=C\CCN1C[C@H](O)[C@@H](O)[C@H](O)[C@H]1CO
InChI Key InChIKey=NIBDZEIDYXAETC-CEXSATNNSA-N
Data  1 KI
  Tab Delimited (TSV)   2D SDfile   Computed 3D by Vconf -m prep SDfile
Find this compound or compounds like it in BindingDB:
Activity Spreadsheet -- Enzyme Inhibition Constant Data from BindingDB
Found 1 hit for monomerid = 50291025
TargetSucrase-isomaltase, intestinal(Rattus norvegicus (Rat))
TBA
Curated by ChEMBL
LigandPNGBDBM50291025((2R,3R,4R,5S)-2-Hydroxymethyl-1-((E)-4-trimethylsi...)
Affinity DataKi:  220nM. Assay description: Tested in vitro for the inhibition constant against rat small intestinal sucrase
In DepthDetails Article