BDBM50291854 4-Oxo-6-[3-(quinolin-2-ylmethoxy)-benzyloxy]-chroman-2-carboxylic acid::CHEMBL46343
SMILES OC(=O)C1CC(=O)c2cc(OCc3cccc(OCc4ccc5ccccc5n4)c3)ccc2O1
InChI Key InChIKey=VOWXZARNNYCPIL-UHFFFAOYSA-N
Data  1 KI
  Tab Delimited (TSV)   2D SDfile   Computed 3D by Vconf -m prep SDfile
Find this compound or compounds like it in BindingDB:
Activity Spreadsheet -- Enzyme Inhibition Constant Data from BindingDB
Found 1 hit for monomerid = 50291854
TargetCysteinyl leukotriene receptor 1(GUINEA PIG)
Rhone-Poulenc Rorer Central Research
Curated by ChEMBL
LigandPNGBDBM50291854(4-Oxo-6-[3-(quinolin-2-ylmethoxy)-benzyloxy]-chrom...)
Affinity DataKi:  1.30nM. Assay description: Binding affinity against LTD4 receptor in guinea pig lung membranes.
In DepthDetails ArticlePubMed