BDBM50291979 CHEMBL176602::N-[[2-METHYL-4-HYDROXYCARBAMOYL]BUT-4-YL-N]-BENZYL-P-[PHENYL]-P-[METHYL]PHOSPHINAMID::N-hydroxy-2(R)-[[(R)-methylphenylphosphinyl]-benzylamino]-4-methylpentanamide
SMILES CC(C)C[C@@H](N(Cc1ccccc1)[P@](C)(=O)c1ccccc1)C(=O)NO
InChI Key InChIKey=KGUVBHLPMGERAT-NIYFSFCBSA-N
Data  7 IC50
PDB links: 1 PDB ID matches this monomer.
  Tab Delimited (TSV)   2D SDfile   Computed 3D by Vconf -m prep SDfile
Find this compound or compounds like it in BindingDB:
Activity Spreadsheet -- Enzyme Inhibition Constant Data from BindingDB
Found 7 hits for monomerid = 50291979
Target72 kDa type IV collagenase(Homo sapiens (Human))
Procter And Gamble Pharmaceuticals
Curated by ChEMBL
LigandPNGBDBM50291979(CHEMBL176602 | N-[[2-METHYL-4-HYDROXYCARBAMOYL]BUT...)
Affinity DataIC50:  13nM. Assay description: Inhibition of human matrix metalloprotease 2
In DepthDetails ArticlePubMed
TargetMatrix metalloproteinase-9(Homo sapiens (Human))
Procter And Gamble Pharmaceuticals
Curated by ChEMBL
LigandPNGBDBM50291979(CHEMBL176602 | N-[[2-METHYL-4-HYDROXYCARBAMOYL]BUT...)
Affinity DataIC50:  21nM. Assay description: Inhibition of human matrix metalloprotease 9
In DepthDetails ArticlePubMed
TargetMatrilysin(Homo sapiens (Human))
Procter And Gamble Pharmaceuticals
Curated by ChEMBL
LigandPNGBDBM50291979(CHEMBL176602 | N-[[2-METHYL-4-HYDROXYCARBAMOYL]BUT...)
Affinity DataIC50:  886nM. Assay description: Inhibition of human matrix metalloprotease 7
In DepthDetails ArticlePubMed
TargetCollagenase 3(Rattus norvegicus)
Procter And Gamble Pharmaceuticals
Curated by ChEMBL
LigandPNGBDBM50291979(CHEMBL176602 | N-[[2-METHYL-4-HYDROXYCARBAMOYL]BUT...)
Affinity DataIC50:  7.40nM. Assay description: Inhibition of rat matrix metalloprotease 13
In DepthDetails ArticlePubMed
TargetNeutrophil collagenase(Homo sapiens (Human))
Procter And Gamble Pharmaceuticals
Curated by ChEMBL
LigandPNGBDBM50291979(CHEMBL176602 | N-[[2-METHYL-4-HYDROXYCARBAMOYL]BUT...)
Affinity DataIC50:  5.30nM. Assay description: Inhibition of human Matrix metalloprotease-8
In DepthDetails ArticlePubMed
TargetStromelysin-1(Homo sapiens (Human))
Procter And Gamble Pharmaceuticals
Curated by ChEMBL
LigandPNGBDBM50291979(CHEMBL176602 | N-[[2-METHYL-4-HYDROXYCARBAMOYL]BUT...)
Affinity DataIC50:  24nM. Assay description: Inhibition of human matrix metalloprotease-3
In DepthDetails ArticlePubMedMMDB
TargetInterstitial collagenase(Homo sapiens (Human))
Procter And Gamble Pharmaceuticals
Curated by ChEMBL
LigandPNGBDBM50291979(CHEMBL176602 | N-[[2-METHYL-4-HYDROXYCARBAMOYL]BUT...)
Affinity DataIC50:  21nM. Assay description: Inhibition of human matrix metalloprotease 1
In DepthDetails ArticlePubMed