BDBM50292045 (Carboxymethyl-{2-[carboxymethyl-(2-sulfamoyl-benzothiazol-6-yloxycarbonylmethyl)-amino]-ethyl}-amino)-acetic acid::CHEMBL284061
SMILES NS(=O)(=O)c1nc2ccc(OC(=O)CN(CCN(CC(O)=O)CC(O)=O)CC(O)=O)cc2s1
InChI Key InChIKey=XRYIGRCTVWSVLX-UHFFFAOYSA-N
Data  3 KI
  Tab Delimited (TSV)   2D SDfile   Computed 3D by Vconf -m prep SDfile
Find this compound or compounds like it in BindingDB:
Activity Spreadsheet -- Enzyme Inhibition Constant Data from BindingDB
Found 3 hits for monomerid = 50292045
TargetCarbonic anhydrase 2(Homo sapiens (Human))
Universit£
Curated by ChEMBL
LigandPNGBDBM50292045((Carboxymethyl-{2-[carboxymethyl-(2-sulfamoyl-benz...)
Affinity DataKi:  2nM. Assay description: Inhibitory activity against Human carbonic anhydrase II
In DepthDetails ArticlePubMed
TargetCarbonic anhydrase 4(Bos taurus (bovine))
Universit£
Curated by ChEMBL
LigandPNGBDBM50292045((Carboxymethyl-{2-[carboxymethyl-(2-sulfamoyl-benz...)
Affinity DataKi:  10nM. Assay description: Inhibitory activity against bovine carbonic anhydrase IV
In DepthDetails ArticlePubMed
TargetCarbonic anhydrase 1(Homo sapiens (Human))
Universit£
Curated by ChEMBL
LigandPNGBDBM50292045((Carboxymethyl-{2-[carboxymethyl-(2-sulfamoyl-benz...)
Affinity DataKi:  43nM. Assay description: Inhibitory activity against Human carbonic anhydrase I
In DepthDetails ArticlePubMed