BDBM50292171 1-[3-(4-Hydroxy-phenyl)-5-(2-methoxy-phenyl)-4,5-dihydro-pyrazol-1-yl]-ethanone::CHEMBL293004
SMILES COc1ccccc1C1CC(=NN1C(C)=O)c1ccc(O)cc1
InChI Key InChIKey=VYYPQTOHWMMVHV-UHFFFAOYSA-N
Data  6 KI  2 IC50
  Tab Delimited (TSV)   2D SDfile   Computed 3D by Vconf -m prep SDfile
Find this compound or compounds like it in BindingDB:
Activity Spreadsheet -- Enzyme Inhibition Constant Data from BindingDB
Found 8 hits for monomerid = 50292171
TargetAmine oxidase [flavin-containing] A(Homo sapiens (Human))
Sapienza University Of Rome
Curated by ChEMBL
LigandPNGBDBM50292171(1-[3-(4-Hydroxy-phenyl)-5-(2-methoxy-phenyl)-4,5-d...)
Affinity DataKi:  2nM. Assay description: Binding affinity was evaluated against human monoamino oxidase A
In DepthDetails ArticlePubMed
TargetAmine oxidase [flavin-containing] A(Homo sapiens (Human))
Sapienza University Of Rome
Curated by ChEMBL
LigandPNGBDBM50292171(1-[3-(4-Hydroxy-phenyl)-5-(2-methoxy-phenyl)-4,5-d...)
Affinity DataKi:  2nM. Assay description: Binding affinity was evaluated against human monoamino oxidase A
In DepthDetails ArticlePubMed
TargetAmine oxidase [flavin-containing] A(Homo sapiens (Human))
Sapienza University Of Rome
Curated by ChEMBL
LigandPNGBDBM50292171(1-[3-(4-Hydroxy-phenyl)-5-(2-methoxy-phenyl)-4,5-d...)
Affinity DataKi:  6nM. Assay description: Binding affinity was evaluated against human monoamino oxidase A
In DepthDetails ArticlePubMed
TargetAmine oxidase [flavin-containing] B(Homo sapiens (Human))
Sapienza University Of Rome
Curated by ChEMBL
LigandPNGBDBM50292171(1-[3-(4-Hydroxy-phenyl)-5-(2-methoxy-phenyl)-4,5-d...)
Affinity DataKi:  3.30E+5nM. Assay description: Binding affinity was evaluated against human monoamino oxidase B
In DepthDetails ArticlePubMed
TargetAmine oxidase [flavin-containing] B(Homo sapiens (Human))
Sapienza University Of Rome
Curated by ChEMBL
LigandPNGBDBM50292171(1-[3-(4-Hydroxy-phenyl)-5-(2-methoxy-phenyl)-4,5-d...)
Affinity DataKi:  3.30E+5nM. Assay description: Binding affinity was evaluated against human monoamino oxidase B
In DepthDetails ArticlePubMed
TargetAmine oxidase [flavin-containing] B(Homo sapiens (Human))
Sapienza University Of Rome
Curated by ChEMBL
LigandPNGBDBM50292171(1-[3-(4-Hydroxy-phenyl)-5-(2-methoxy-phenyl)-4,5-d...)
Affinity DataKi:  1.00E+6nM. Assay description: Binding affinity was evaluated against human monoamino oxidase B
In DepthDetails ArticlePubMed
TargetAmine oxidase [flavin-containing] B(Homo sapiens (Human))
Sapienza University Of Rome
Curated by ChEMBL
LigandPNGBDBM50292171(1-[3-(4-Hydroxy-phenyl)-5-(2-methoxy-phenyl)-4,5-d...)
Affinity DataIC50:  1.00E+5nM. Assay description: Inhibition of human monoamine oxidase B
In DepthDetails ArticlePubMed
TargetAmine oxidase [flavin-containing] A(Homo sapiens (Human))
Sapienza University Of Rome
Curated by ChEMBL
LigandPNGBDBM50292171(1-[3-(4-Hydroxy-phenyl)-5-(2-methoxy-phenyl)-4,5-d...)
Affinity DataIC50:  8.80nM. Assay description: Inhibition of human monoamine oxidase A
In DepthDetails ArticlePubMed