BDBM50292338 CHEMBL463772::decarbomethoxytetrahydrosecodine
SMILES CCC1CCCN(CCc2c(CC)[nH]c3ccccc23)C1
InChI Key InChIKey=IPGCFOJDVQPHFH-UHFFFAOYSA-N
Data  1 IC50
  Tab Delimited (TSV)   2D SDfile   Computed 3D by Vconf -m prep SDfile
Find this compound or compounds like it in BindingDB:
Activity Spreadsheet -- Enzyme Inhibition Constant Data from BindingDB
Found 1 hit for monomerid = 50292338
TargetAcetylcholinesterase(Electrophorus electricus (Electric eel))
TBA
Curated by ChEMBL
LigandPNGBDBM50292338(CHEMBL463772 | decarbomethoxytetrahydrosecodine)
Affinity DataIC50:  2.03E+5nM. Assay description: Inhibition of electric eel AChE
In DepthDetails Article