BDBM50292393 CHEMBL507352::phosphatidyl glycerol
SMILES CCCCCCCCCCCCCCCC(=O)OCC(COP(O)(=O)OCC(O)CO)OC(=O)CCCCCCC\C=C\C\C=C\CCCCC
InChI Key InChIKey=ATBOMIWRCZXYSZ-XZBBILGWSA-N
Data  1 IC50
  Tab Delimited (TSV)   2D SDfile   Computed 3D by Vconf -m prep SDfile
Find this compound or compounds like it in BindingDB:
Activity Spreadsheet -- Enzyme Inhibition Constant Data from BindingDB
Found 1 hit for monomerid = 50292393
TargetP-selectin(Homo sapiens (Human))
Bristol-Myers Squibb Pharmaceutical Research Institute
Curated by ChEMBL
LigandPNGBDBM50292393(CHEMBL507352 | phosphatidyl glycerol)
Affinity DataIC50:  1.00E+3nM. Assay description: Displacement of immobilized sulfatide from P-selectin transfected in african green monkey COS cells by IgG-based competitive ELISA
In DepthDetails ArticlePubMed