BDBM50292505 (ppG)2::CHEMBL448348::Diguanosine tetraphosphate::G(5')p4(5')G::GP4G::P(1),P(4)-bis(5'-guanosyl) tetrahydrogen tetraphosphate::P(1),P(4)-bis(5'-guanosyl) tetraphosphate::bis(guanylyl) diphosphate::guanosine(5')tetraphospho(5')guanosine
SMILES Nc1nc2n(cnc2c(=O)[nH]1)[C@@H]1O[C@H](COP(O)(=O)OP(O)(=O)OP(O)(=O)OP(O)(=O)OC[C@H]2O[C@H]([C@H](O)[C@@H]2O)n2cnc3c2nc(N)[nH]c3=O)[C@@H](O)[C@H]1O
InChI Key InChIKey=OLGWXCQXRSSQPO-MHARETSRSA-N
Data  1 IC50
PDB links: 1 PDB ID matches this monomer.
  Tab Delimited (TSV)   2D SDfile   Computed 3D by Vconf -m prep SDfile
Find this compound or compounds like it in BindingDB:
Activity Spreadsheet -- Enzyme Inhibition Constant Data from BindingDB
Found 1 hit for monomerid = 50292505
TargetProto-oncogene tyrosine-protein kinase Src(Homo sapiens (Human))
TBA
Curated by ChEMBL
LigandPNGBDBM50292505((ppG)2 | CHEMBL448348 | Diguanosine tetraphosphate...)
Affinity DataIC50: >1.00E+5nM. Assay description: Inhibition of p60c-src expressed in chick embryo fibroblast
In DepthDetails ArticlePubMed