BDBM50292673 (+/-)-1'-(4-bromobenzyl)-3-phenyl-3,4'-bipiperidine-1-sulfonamide::CHEMBL495940
SMILES NS(=O)(=O)N1CCCC(C1)(C1CCN(Cc2ccc(Br)cc2)CC1)c1ccccc1
InChI Key InChIKey=CQRATEQQEZFVNL-UHFFFAOYSA-N
Data  1 IC50
  Tab Delimited (TSV)   2D SDfile   Computed 3D by Vconf -m prep SDfile
Find this compound or compounds like it in BindingDB:
Activity Spreadsheet -- Enzyme Inhibition Constant Data from BindingDB
Found 1 hit for monomerid = 50292673
TargetC-X-C chemokine receptor type 3(Homo sapiens (Human))
Johnson & Johnson Prd
Curated by ChEMBL
LigandPNGBDBM50292673((+/-)-1'-(4-bromobenzyl)-3-phenyl-3,4'-bipiperidin...)
Affinity DataIC50:  210nM. Assay description: Antagonist activity at human CXCR3 expressed in CHO cells assessed as inhibition of ITAC-stimulated [35S]GTPgammaS binding pretreated 30 mins before ...
In DepthDetails ArticlePubMed