BDBM50292718 5'-deoxy-5'-N-pyrrolidinouridine::CHEMBL513623
SMILES O[C@@H]1[C@@H](CN2CCCC2)O[C@H]([C@@H]1O)n1ccc(=O)[nH]c1=O
InChI Key InChIKey=RPODXOXNOBCNGM-HJQYOEGKSA-N
Data  1 KI
  Tab Delimited (TSV)   2D SDfile   Computed 3D by Vconf -m prep SDfile
Find this compound or compounds like it in BindingDB:
Activity Spreadsheet -- Enzyme Inhibition Constant Data from BindingDB
Found 1 hit for monomerid = 50292718
TargetRibonuclease pancreatic(Bison bison (American bison))
Institute Of Technology
Curated by ChEMBL
LigandPNGBDBM50292718(5'-deoxy-5'-N-pyrrolidinouridine | CHEMBL513623)
Affinity DataKi:  2.03E+5nM. Assay description: Inhibition of bovine pancreatic RNase A by spectrophotometric method
In DepthDetails ArticlePubMed