BDBM50292793 4-(3-{5-Chloro-1-(diphenylmethyl)-2-[2-({[2-(hydroxymethyl)benzyl]sulfonyl}amino)ethyl]-1H-indol-3-yl}propyl)benzoic Acid::CHEMBL506097
SMILES OCc1ccccc1CS(=O)(=O)NCCc1c(CCCc2ccc(cc2)C(O)=O)c2cc(Cl)ccc2n1C(c1ccccc1)c1ccccc1
InChI Key InChIKey=LFBTUGUIMZEBCF-UHFFFAOYSA-N
Data  1 IC50
  Tab Delimited (TSV)   2D SDfile   Computed 3D by Vconf -m prep SDfile
Find this compound or compounds like it in BindingDB:
Activity Spreadsheet -- Enzyme Inhibition Constant Data from BindingDB
Found 1 hit for monomerid = 50292793
TargetCytosolic phospholipase A2(Homo sapiens (Human))
Wyeth Research
Curated by ChEMBL
LigandPNGBDBM50292793(4-(3-{5-Chloro-1-(diphenylmethyl)-2-[2-({[2-(hydro...)
Affinity DataIC50:  22nM. Assay description: Inhibition of human cytosolic PLA2alpha by GLU micelle assay
In DepthDetails ArticlePubMed