BDBM50293109 6-Methoxy-2-m-tolylbenzo[d]thiazole::CHEMBL460507
SMILES COc1ccc2nc(sc2c1)-c1cccc(C)c1
InChI Key InChIKey=FWSNNNJEXXLSCD-UHFFFAOYSA-N
Data  3 IC50
  Tab Delimited (TSV)   2D SDfile   Computed 3D by Vconf -m prep SDfile
Find this compound or compounds like it in BindingDB:
Activity Spreadsheet -- Enzyme Inhibition Constant Data from BindingDB
Found 3 hits for monomerid = 50293109
TargetLuciferin 4-monooxygenase(Photuris pennsylvanica)
National Institutes Of Health
Curated by ChEMBL
LigandPNGBDBM50293109(6-Methoxy-2-m-tolylbenzo[d]thiazole | CHEMBL460507)
Affinity DataIC50: >5.00E+4nM. Assay description: Inhibition of luciferin binding site of Photuris pennsylvanica luciferase by competitive KinaseGlo luminescent assay
In DepthDetails ArticlePubMed
TargetLuciferin 4-monooxygenase(Photinus pyralis)
National Institutes Of Health
Curated by ChEMBL
LigandPNGBDBM50293109(6-Methoxy-2-m-tolylbenzo[d]thiazole | CHEMBL460507)
Affinity DataIC50:  1.50E+3nM. Assay description: Inhibition of luciferin binding site of Photinus pyralis luciferase by competitive inhibition assay
In DepthDetails ArticlePubMed
TargetLuciferin 4-monooxygenase(Photuris pennsylvanica)
National Institutes Of Health
Curated by ChEMBL
LigandPNGBDBM50293109(6-Methoxy-2-m-tolylbenzo[d]thiazole | CHEMBL460507)
Affinity DataIC50:  670nM. Assay description: Inhibition of luciferin binding site of Photuris pennsylvanica luciferase by competitive inhibition assay
In DepthDetails ArticlePubMed