BDBM50293455 4-((1-(benzo[d][1,3]dioxol-5-ylmethyl)piperidin-4-yl)methyl)-N-(1-phenylpropyl)benzamide::CHEMBL564409
SMILES CCC(NC(=O)c1ccc(CC2CCN(Cc3ccc4OCOc4c3)CC2)cc1)c1ccccc1
InChI Key InChIKey=QCPXRXKBSRYKGN-UHFFFAOYSA-N
Data  1 KI  1 IC50
  Tab Delimited (TSV)   2D SDfile   Computed 3D by Vconf -m prep SDfile
Find this compound or compounds like it in BindingDB:
Activity Spreadsheet -- Enzyme Inhibition Constant Data from BindingDB
Found 2 hits for monomerid = 50293455
TargetMelanin-concentrating hormone receptor 1(Homo sapiens (Human))
University Of Jordan
Curated by ChEMBL
LigandPNGBDBM50293455(4-((1-(benzo[d][1,3]dioxol-5-ylmethyl)piperidin-4-...)
Affinity DataKi:  1.83E+3nM. Assay description: Binding affinity to MCH1 receptor
In DepthDetails ArticlePubMed
TargetMelanin-concentrating hormone receptor 1(Homo sapiens (Human))
University Of Jordan
Curated by ChEMBL
LigandPNGBDBM50293455(4-((1-(benzo[d][1,3]dioxol-5-ylmethyl)piperidin-4-...)
Affinity DataIC50:  1.80E+3nM. Assay description: Antagonist activity at MCHR1 (unknown origin) expressed in CHO cells co-expressing aequorin incubated for 10 mins by luminescence assay
In DepthDetails ArticlePubMed