BDBM50293492 3-(3-((N-(4-tert-butylbenzyl)phenylsulfonamido)methyl)phenyl)propanoic acid::CHEMBL559065
SMILES CC(C)(C)c1ccc(CN(Cc2cccc(CCC(O)=O)c2)S(=O)(=O)c2ccccc2)cc1
InChI Key InChIKey=YUHXGDPKYPIVGM-UHFFFAOYSA-N
Data  2 IC50  1 EC50
  Tab Delimited (TSV)   2D SDfile   Computed 3D by Vconf -m prep SDfile
Find this compound or compounds like it in BindingDB:
Activity Spreadsheet -- Enzyme Inhibition Constant Data from BindingDB
Found 3 hits for monomerid = 50293492
TargetProstaglandin E2 receptor EP2 subtype(Rattus norvegicus)
Pfizer
Curated by ChEMBL
LigandPNGBDBM50293492(3-(3-((N-(4-tert-butylbenzyl)phenylsulfonamido)met...)
Affinity DataEC50:  0.200nM. Assay description: Agonist activity against rat EP2 receptor expressed in HEK293 cells assessed as stimulation of cAMP release
In DepthDetails ArticlePubMed
TargetProstaglandin E2 receptor EP4 subtype(Rattus norvegicus)
Pfizer
Curated by ChEMBL
LigandPNGBDBM50293492(3-(3-((N-(4-tert-butylbenzyl)phenylsulfonamido)met...)
Affinity DataIC50: >3.20E+3nM. Assay description: Inhibition of rat EP4 receptor expressed in HEK293 cells
In DepthDetails ArticlePubMed
TargetProstaglandin E2 receptor EP2 subtype(Rattus norvegicus)
Pfizer
Curated by ChEMBL
LigandPNGBDBM50293492(3-(3-((N-(4-tert-butylbenzyl)phenylsulfonamido)met...)
Affinity DataIC50:  278nM. Assay description: Inhibition of rat EP2 receptor expressed in HEK293 cells
In DepthDetails ArticlePubMed