BDBM50293493 3-(3-((N-(4-tert-butylbenzyl)pyridine-2-sulfonamido)methyl)phenyl)propanoic acid::CHEMBL541516
SMILES CC(C)(C)c1ccc(CN(Cc2cccc(CCC(O)=O)c2)S(=O)(=O)c2ccccn2)cc1
InChI Key InChIKey=SBKAQMPPKOPHSX-UHFFFAOYSA-N
Data  2 IC50  1 EC50
  Tab Delimited (TSV)   2D SDfile   Computed 3D by Vconf -m prep SDfile
Find this compound or compounds like it in BindingDB:
Activity Spreadsheet -- Enzyme Inhibition Constant Data from BindingDB
Found 3 hits for monomerid = 50293493
TargetProstaglandin E2 receptor EP2 subtype(Rattus norvegicus)
Pfizer
Curated by ChEMBL
LigandPNGBDBM50293493(3-(3-((N-(4-tert-butylbenzyl)pyridine-2-sulfonamid...)
Affinity DataEC50:  2.30nM. Assay description: Agonist activity against rat EP2 receptor expressed in HEK293 cells assessed as stimulation of cAMP release
In DepthDetails ArticlePubMed
TargetProstaglandin E2 receptor EP4 subtype(Rattus norvegicus)
Pfizer
Curated by ChEMBL
LigandPNGBDBM50293493(3-(3-((N-(4-tert-butylbenzyl)pyridine-2-sulfonamid...)
Affinity DataIC50: >3.20E+3nM. Assay description: Inhibition of rat EP4 receptor expressed in HEK293 cells
In DepthDetails ArticlePubMed
TargetProstaglandin E2 receptor EP2 subtype(Rattus norvegicus)
Pfizer
Curated by ChEMBL
LigandPNGBDBM50293493(3-(3-((N-(4-tert-butylbenzyl)pyridine-2-sulfonamid...)
Affinity DataIC50:  52nM. Assay description: Inhibition of rat EP2 receptor expressed in HEK293 cells
In DepthDetails ArticlePubMed