BDBM50293500 7-(N-(4-hexanoylbenzyl)methylsulfonamido)heptanoic acid::CHEMBL562291
SMILES CCCCCC(=O)c1ccc(CN(CCCCCCC(O)=O)S(C)(=O)=O)cc1
InChI Key InChIKey=NMROFMQEMIWYTD-UHFFFAOYSA-N
Data  2 IC50  1 EC50
  Tab Delimited (TSV)   2D SDfile   Computed 3D by Vconf -m prep SDfile
Find this compound or compounds like it in BindingDB:
Activity Spreadsheet -- Enzyme Inhibition Constant Data from BindingDB
Found 3 hits for monomerid = 50293500
TargetProstaglandin E2 receptor EP2 subtype(Rattus norvegicus)
Pfizer
Curated by ChEMBL
LigandPNGBDBM50293500(7-(N-(4-hexanoylbenzyl)methylsulfonamido)heptanoic...)
Affinity DataIC50:  636nM. Assay description: Inhibition of rat EP2 receptor expressed in HEK293 cells
In DepthDetails ArticlePubMed
TargetProstaglandin E2 receptor EP2 subtype(Rattus norvegicus)
Pfizer
Curated by ChEMBL
LigandPNGBDBM50293500(7-(N-(4-hexanoylbenzyl)methylsulfonamido)heptanoic...)
Affinity DataEC50:  887nM. Assay description: Agonist activity against rat EP2 receptor expressed in HEK293 cells assessed as stimulation of cAMP release
In DepthDetails ArticlePubMed
TargetProstaglandin E2 receptor EP4 subtype(Rattus norvegicus)
Pfizer
Curated by ChEMBL
LigandPNGBDBM50293500(7-(N-(4-hexanoylbenzyl)methylsulfonamido)heptanoic...)
Affinity DataIC50: >3.20E+3nM. Assay description: Inhibition of rat EP4 receptor expressed in HEK293 cells
In DepthDetails ArticlePubMed