BDBM50293576 4-(4-phenylthiazol-2-ylamino)phenol::4131JH0380::CHEMBL562493
SMILES Oc1ccc(Nc2nc(cs2)-c2ccccc2)cc1
InChI Key InChIKey=DERMXGZWGLKTNH-UHFFFAOYSA-N
Data  6 IC50  1 EC50
  Tab Delimited (TSV)   2D SDfile   Computed 3D by Vconf -m prep SDfile
Find this compound or compounds like it in BindingDB:
Activity Spreadsheet -- Enzyme Inhibition Constant Data from BindingDB
Found 7 hits for monomerid = 50293576
TargetPolyunsaturated fatty acid 5-lipoxygenase(Homo sapiens (Human))
Korea Research Institute Of Chemical Technology
LigandPNGBDBM50293576(4-(4-phenylthiazol-2-ylamino)phenol | 4131JH0380 |...)
Affinity DataIC50:  110nMpH: 7.4 T: 2°C. Assay description: 5-LOX enzyme assay was carried out with some modifications of ferric oxidation of xylenol orange (FOX) assay, which is based on the complex formation...
In DepthDetails ArticlePubMed
TargetPolyunsaturated fatty acid 5-lipoxygenase(Homo sapiens (Human))
Korea Research Institute Of Chemical Technology
LigandPNGBDBM50293576(4-(4-phenylthiazol-2-ylamino)phenol | 4131JH0380 |...)
Affinity DataIC50:  100nM. Assay description: Inhibition of partially purified recombinant 5-lipoxygenase (unknown origin) using arachidonic acid as substrate preincubated for 15 mins before subs...
In DepthDetails ArticlePubMed
TargetPolyunsaturated fatty acid 5-lipoxygenase(Homo sapiens (Human))
Korea Research Institute Of Chemical Technology
LigandPNGBDBM50293576(4-(4-phenylthiazol-2-ylamino)phenol | 4131JH0380 |...)
Affinity DataIC50:  300nM. Assay description: Inhibition of 5-lipoxygenase in human PMNL using arachidonic acid as substrate preincubated for 15 mins before substrate addition measured after 10 m...
In DepthDetails ArticlePubMed
TargetTransitional endoplasmic reticulum ATPase(Homo sapiens (Human))
Kyowa Hakko Kogyo
Curated by ChEMBL
LigandPNGBDBM50293576(4-(4-phenylthiazol-2-ylamino)phenol | 4131JH0380 |...)
Affinity DataIC50:  190nM. Assay description: Inhibition of VCP assessed as conversion of ATP to ADP by enzyme coupled glucokinase assay
In DepthDetails ArticlePubMed
TargetFructose-1,6-bisphosphatase 1(Sus scrofa (Pig))
Boston College
Curated by ChEMBL
LigandPNGBDBM50293576(4-(4-phenylthiazol-2-ylamino)phenol | 4131JH0380 |...)
Affinity DataIC50:  1.24E+5nM. Assay description: Inhibition of pig FBPase expressed in Escherichia coli EK1601 by spectrophotometry
In DepthDetails ArticlePubMed
TargetTransitional endoplasmic reticulum ATPase(Homo sapiens (Human))
Kyowa Hakko Kogyo
Curated by ChEMBL
LigandPNGBDBM50293576(4-(4-phenylthiazol-2-ylamino)phenol | 4131JH0380 |...)
Affinity DataEC50:  520nM. Assay description: Inhibition of VCP in human HeLa cells assessed as stabilization of ubiquitin-tagged luciferase after 24 hrs by reporter gene assay
In DepthDetails ArticlePubMed
TargetAlpha-amylase 1A(Homo sapiens (Human))
Freie Universit£T Berlin
Curated by ChEMBL
LigandPNGBDBM50293576(4-(4-phenylthiazol-2-ylamino)phenol | 4131JH0380 |...)
Affinity DataIC50:  1.27E+6nM. Assay description: Inhibition of human salivary alpha-amylase using GalG2CNP as substrate by UV-Vis spectrophotometric analysis
In DepthDetails ArticlePubMed