BDBM50293821 2-(2-(6-oxo-1,6,7,8-tetrahydropurin-9-yl)ethoxy)ethylphosphonate::CHEMBL570784
SMILES OP(O)(=O)CCOCCN1CNc2c1nc[nH]c2=O
InChI Key InChIKey=FWNFOZMUZNIOND-UHFFFAOYSA-N
Data  1 KI
  Tab Delimited (TSV)   2D SDfile   Computed 3D by Vconf -m prep SDfile
Find this compound or compounds like it in BindingDB:
Activity Spreadsheet -- Enzyme Inhibition Constant Data from BindingDB
Found 1 hit for monomerid = 50293821
TargetHypoxanthine-guanine phosphoribosyltransferase(Homo sapiens (Human))
The University Of Queensland
Curated by ChEMBL
LigandPNGBDBM50293821(2-(2-(6-oxo-1,6,7,8-tetrahydropurin-9-yl)ethoxy)et...)
Affinity DataKi:  3.60E+3nMpH: 7.4Assay Description:Inhibition of human recombinant HGPRT at pH 7.4 by spectrophotometric assay
In DepthDetails ArticlePubMed