BDBM50293825 (2-(2-amino-8-bromo-6-oxo-1,6,7,8-tetrahydropurin-9-yl)ethoxy)methylphosphonate::CHEMBL552444
SMILES Nc1nc2N(CCOCP(O)(O)=O)C(Br)Nc2c(=O)[nH]1
InChI Key InChIKey=FOGWYLOWQXKOMA-UHFFFAOYSA-N
Data  1 KI
  Tab Delimited (TSV)   2D SDfile   Computed 3D by Vconf -m prep SDfile
Find this compound or compounds like it in BindingDB:
Activity Spreadsheet -- Enzyme Inhibition Constant Data from BindingDB
Found 1 hit for monomerid = 50293825
TargetHypoxanthine-guanine phosphoribosyltransferase(Homo sapiens (Human))
The University Of Queensland
Curated by ChEMBL
LigandPNGBDBM50293825((2-(2-amino-8-bromo-6-oxo-1,6,7,8-tetrahydropurin-...)
Affinity DataKi: >4.00E+5nMpH: 7.4Assay Description:Inhibition of human recombinant HGPRT at pH 7.4 by spectrophotometric assay
In DepthDetails ArticlePubMed