BDBM50293913 (R)-5-Chloro-1-(1-cyclopropylpropyl)-3-(2,4,6-trimethylphenylamino)pyrazin-2(1H)-one::(R)-5-chloro-1-(1-cyclopropylpropyl)-3-(mesitylamino)pyrazin-2(1H)-one::CHEMBL563489
SMILES CC[C@H](C1CC1)n1cc(Cl)nc(Nc2c(C)cc(C)cc2C)c1=O
InChI Key InChIKey=GLUAGXWOZAAPFZ-OAHLLOKOSA-N
Data  2 IC50
  Tab Delimited (TSV)   2D SDfile   Computed 3D by Vconf -m prep SDfile
Find this compound or compounds like it in BindingDB:
Activity Spreadsheet -- Enzyme Inhibition Constant Data from BindingDB
Found 2 hits for monomerid = 50293913
TargetCorticotropin-releasing factor receptor 1(Rattus norvegicus (rat))
Bristol-Myers Squibb
Curated by ChEMBL
LigandPNGBDBM50293913((R)-5-Chloro-1-(1-cyclopropylpropyl)-3-(2,4,6-trim...)
Affinity DataIC50:  0.630nM. Assay description: Displacement of [125I]ovine-CRF from CRF1 receptor in rat frontal cortex by rapid filtration technique
In DepthDetails ArticlePubMed
TargetCorticotropin-releasing factor receptor 1(Rattus norvegicus (rat))
Bristol-Myers Squibb
Curated by ChEMBL
LigandPNGBDBM50293913((R)-5-Chloro-1-(1-cyclopropylpropyl)-3-(2,4,6-trim...)
Affinity DataIC50:  0.630nM. Assay description: Displacement of [125I]Tyr-ovine-CRF from CRF1 receptor in rat frontal cortex homogenate by gamma counting
In DepthDetails ArticlePubMed