BDBM50293939 (R)-5-Chloro-3-(4-chloro-2-methoxy-5-methylphenylamino)-1-(1-cyclopropylethyl)pyrazin-2(1H)-one::CHEMBL538866
SMILES COc1cc(Cl)c(C)cc1Nc1nc(Cl)cn([C@H](C)C2CC2)c1=O
InChI Key InChIKey=JRZJYJNCDXLIAK-SNVBAGLBSA-N
Data  1 IC50
  Tab Delimited (TSV)   2D SDfile   Computed 3D by Vconf -m prep SDfile
Find this compound or compounds like it in BindingDB:
Activity Spreadsheet -- Enzyme Inhibition Constant Data from BindingDB
Found 1 hit for monomerid = 50293939
TargetCorticotropin-releasing factor receptor 1(Rattus norvegicus (rat))
Bristol-Myers Squibb
Curated by ChEMBL
LigandPNGBDBM50293939((R)-5-Chloro-3-(4-chloro-2-methoxy-5-methylphenyla...)
Affinity DataIC50:  36nM. Assay description: Displacement of [125I]ovine-CRF from CRF1 receptor in rat frontal cortex by rapid filtration technique
In DepthDetails ArticlePubMed