BDBM50294181 CHEMBL4169456
SMILES Brc1ccc2[nH]c(nc2c1)-c1cc2ccccc2n1Cc1ccccc1
InChI Key InChIKey=RRHVGGGMHFLMBW-UHFFFAOYSA-N
Data  1 IC50
  Tab Delimited (TSV)   2D SDfile   Computed 3D by Vconf -m prep SDfile
Find this compound or compounds like it in BindingDB:
Activity Spreadsheet -- Enzyme Inhibition Constant Data from BindingDB
Found 1 hit for monomerid = 50294181
TargetEstrogen receptor(Homo sapiens (Human))
Central University Of Punjab
Curated by ChEMBL
LigandPNGBDBM50294181(CHEMBL4169456)
Affinity DataIC50:  74nM. Assay description: Displacement of fluoromone TM from recombinant human ERalpha after 2 hrs by fluorescence polarization analysis
In DepthDetails ArticlePubMed