BDBM50294204 3-(5-((2,4-diaminopyrimidin-5-yl)methyl)-2,3-dimethoxyphenyl)-1-(1-p-tolylphthalazin-2(1H)-yl)prop-2-en-1-one::CHEMBL550083
SMILES COc1cc(Cc2cnc(N)nc2N)cc(\C=C\C(=O)N2N=Cc3ccccc3C2c2ccc(C)cc2)c1OC
InChI Key InChIKey=YQJQZCMRSICFNE-OUKQBFOZSA-N
Data  2 IC50
  Tab Delimited (TSV)   2D SDfile   Computed 3D by Vconf -m prep SDfile
Find this compound or compounds like it in BindingDB:
Activity Spreadsheet -- Enzyme Inhibition Constant Data from BindingDB
Found 2 hits for monomerid = 50294204
TargetDihydrofolate reductase(Homo sapiens (Human))
Oklahoma State University
Curated by ChEMBL
LigandPNGBDBM50294204(3-(5-((2,4-diaminopyrimidin-5-yl)methyl)-2,3-dimet...)
Affinity DataIC50: >1.90E+4nM. Assay description: Inhibition of human recombinant DHFR
In DepthDetails ArticlePubMed
TargetDihydrofolate reductase(Rattus norvegicus (rat))
Oklahoma State University
Curated by ChEMBL
LigandPNGBDBM50294204(3-(5-((2,4-diaminopyrimidin-5-yl)methyl)-2,3-dimet...)
Affinity DataIC50:  2.50E+4nM. Assay description: Inhibition of rat DHFR
In DepthDetails ArticlePubMed