BDBM50294528 CHEMBL454431::methyl 2,4-dihydroxy-6-methylbenzoate::methyl orsellinate
SMILES COC(=O)c1c(C)cc(O)cc1O
InChI Key InChIKey=NCCWCZLEACWJIN-UHFFFAOYSA-N
Data  1 IC50
  Tab Delimited (TSV)   2D SDfile   Computed 3D by Vconf -m prep SDfile
Find this compound or compounds like it in BindingDB:
Activity Spreadsheet -- Enzyme Inhibition Constant Data from BindingDB
Found 1 hit for monomerid = 50294528
TargetTyrosine-protein phosphatase non-receptor type 1(Homo sapiens (Human))
Silla University
Curated by ChEMBL
LigandPNGBDBM50294528(CHEMBL454431 | methyl 2,4-dihydroxy-6-methylbenzoa...)
Affinity DataIC50: >2.00E+5nM. Assay description: Inhibition of PTP1B
In DepthDetails ArticlePubMed