BDBM50294568 (2R,3R,4S,5S)-2-(6-amino-9H-purin-9-yl)-5-(((S)-pyrrolidin-2-ylmethylthio)methyl)tetrahydrofuran-3,4-diol::CHEMBL563782
SMILES Nc1ncnc2n(cnc12)[C@@H]1O[C@H](CSC[C@@H]2CCCN2)[C@@H](O)[C@H]1O
InChI Key InChIKey=KRSALZDJVWCEKY-OPYVMVOTSA-N
Data  2 IC50
  Tab Delimited (TSV)   2D SDfile   Computed 3D by Vconf -m prep SDfile
Find this compound or compounds like it in BindingDB:
Activity Spreadsheet -- Enzyme Inhibition Constant Data from BindingDB
Found 2 hits for monomerid = 50294568
TargetDNA (cytosine-5)-methyltransferase 3B(Homo sapiens (Human))
Methylgene
Curated by ChEMBL
LigandPNGBDBM50294568((2R,3R,4S,5S)-2-(6-amino-9H-purin-9-yl)-5-(((S)-py...)
Affinity DataIC50:  1.00E+5nM. Assay description: Inhibition of human recombinant DNMT3b2
In DepthDetails ArticlePubMed
TargetDNA (cytosine-5)-methyltransferase 1(Homo sapiens (Human))
Methylgene
Curated by ChEMBL
LigandPNGBDBM50294568((2R,3R,4S,5S)-2-(6-amino-9H-purin-9-yl)-5-(((S)-py...)
Affinity DataIC50:  1.90E+4nM. Assay description: Inhibition of human recombinant DNMT1
In DepthDetails ArticlePubMed