BDBM50295277 (2-Phenylamino-phenyl)-acetic acid::2-(2-(phenylamino)phenyl)acetic acid::2-Anilinophenylacetic acid::CHEMBL78188
SMILES OC(=O)Cc1ccccc1Nc1ccccc1
InChI Key InChIKey=NJFCAWNKWPIBAG-UHFFFAOYSA-N
Data  3 IC50
  Tab Delimited (TSV)   2D SDfile   Computed 3D by Vconf -m prep SDfile
Find this compound or compounds like it in BindingDB:
Activity Spreadsheet -- Enzyme Inhibition Constant Data from BindingDB
Found 3 hits for monomerid = 50295277
TargetInterleukin-8(Homo sapiens (Human))
Grupo Uriach
Curated by ChEMBL
LigandPNGBDBM50295277((2-Phenylamino-phenyl)-acetic acid | 2-(2-(phenyla...)
Affinity DataIC50: >1.00E+3nM. Assay description: Inhibition of CXCL8-induced chemotaxis in human polymorphonuclear leukocyte pretreated for 15 mins measured after 4 hrs by cell migration assay
In DepthDetails ArticlePubMed
TargetProstaglandin G/H synthase 1/2(Homo sapiens (Human))TBA
LigandPNGBDBM50295277((2-Phenylamino-phenyl)-acetic acid | 2-(2-(phenyla...)
Affinity DataIC50:  3.47E+6nM. Assay description: Inhibition of COX (unknown origin)
In DepthDetails Article
TargetProstaglandin G/H synthase 1/2(Bos taurus)
Ciba-Geigy
Curated by ChEMBL
LigandPNGBDBM50295277((2-Phenylamino-phenyl)-acetic acid | 2-(2-(phenyla...)
Affinity DataIC50:  3.47E+6nM. Assay description: In vitro inhibition of bovine prostaglandin G/H synthase, using bovine seminal vesicle microsomal preparations; IC50 in umol/L
In DepthDetails ArticlePubMed