BDBM50295280 (2-Phenoxy-phenyl)-acetic acid::2-(2-phenoxyphenyl)acetic acid::CHEMBL285319
SMILES OC(=O)Cc1ccccc1Oc1ccccc1
InChI Key InChIKey=CWWCQGGNKDBSNT-UHFFFAOYSA-N
Data  1 IC50
  Tab Delimited (TSV)   2D SDfile   Computed 3D by Vconf -m prep SDfile
Find this compound or compounds like it in BindingDB:
Activity Spreadsheet -- Enzyme Inhibition Constant Data from BindingDB
Found 1 hit for monomerid = 50295280
TargetInterleukin-8(Homo sapiens (Human))
Grupo Uriach
Curated by ChEMBL
LigandPNGBDBM50295280((2-Phenoxy-phenyl)-acetic acid | 2-(2-phenoxypheny...)
Affinity DataIC50: >1.00E+3nM. Assay description: Inhibition of CXCL8-induced chemotaxis in human polymorphonuclear leukocyte pretreated for 15 mins measured after 4 hrs by cell migration assay
In DepthDetails ArticlePubMed