BDBM50295353 2-(2-{2-[4-(7-Butyl-5-methyl-5H-pyrrolo[2,3-b]pyrazin-6-yl)phenoxy]ethoxy}ethoxy)ethylamine::CHEMBL551510
SMILES CCCCc1c(-c2ccc(OCCOCCOCCN)cc2)n(C)c2nccnc12
InChI Key InChIKey=AEJUKQOEFGOINZ-UHFFFAOYSA-N
Data  1 IC50
  Tab Delimited (TSV)   2D SDfile   Computed 3D by Vconf -m prep SDfile
Find this compound or compounds like it in BindingDB:
Activity Spreadsheet -- Enzyme Inhibition Constant Data from BindingDB
Found 1 hit for monomerid = 50295353
TargetCyclin-dependent kinase 5(Homo sapiens (Human))
Cnrs Usr-3151
Curated by ChEMBL
LigandPNGBDBM50295353(2-(2-{2-[4-(7-Butyl-5-methyl-5H-pyrrolo[2,3-b]pyra...)
Affinity DataIC50:  5.00E+4nM. Assay description: Inhibition of GST-fused recombinant CDK5/p25 expressed in Escherichia coli after 30 mins by scintillation counting
In DepthDetails ArticlePubMed