BDBM50295729 1-(phenylsulfonyl)-1H-pyrrolo[3,2-b]pyridine::CHEMBL556118
SMILES O=S(=O)(c1ccccc1)n1ccc2ncccc12
InChI Key InChIKey=HGOGRVVSSAWHTO-UHFFFAOYSA-N
Data  2 IC50
  Tab Delimited (TSV)   2D SDfile   Computed 3D by Vconf -m prep SDfile
Find this compound or compounds like it in BindingDB:
Activity Spreadsheet -- Enzyme Inhibition Constant Data from BindingDB
Found 2 hits for monomerid = 50295729
TargetHepatocyte growth factor receptor(Homo sapiens (Human))
Sichuan University
Curated by ChEMBL
LigandPNGBDBM50295729(1-(phenylsulfonyl)-1H-pyrrolo[3,2-b]pyridine | CHE...)
Affinity DataIC50:  3.50E+3nM. Assay description: Inhibition of human c-MET
In DepthDetails ArticlePubMed
TargetHepatocyte growth factor receptor(Homo sapiens (Human))
Sichuan University
Curated by ChEMBL
LigandPNGBDBM50295729(1-(phenylsulfonyl)-1H-pyrrolo[3,2-b]pyridine | CHE...)
Affinity DataIC50:  3.50E+3nM. Assay description: Inhibition of human recombinant His-tagged c-Met by TR-FRET assay
In DepthDetails ArticlePubMed