BDBM50295785 CHEMBL552321::N-(3-(dipropylamino)-2-hydroxypropoxy)benzo[d]oxazole-2-carbimidoyl chloride
SMILES CCCN(CCC)CC(O)CO\N=C(/Cl)c1nc2ccccc2o1
InChI Key InChIKey=PMCAJNCIVVEHKO-SILNSSARSA-N
Data  1 EC50
  Tab Delimited (TSV)   2D SDfile   Computed 3D by Vconf -m prep SDfile
Find this compound or compounds like it in BindingDB:
Activity Spreadsheet -- Enzyme Inhibition Constant Data from BindingDB
Found 1 hit for monomerid = 50295785
TargetHeat shock factor protein 1(Homo sapiens (Human))
Cytrx
Curated by ChEMBL
LigandPNGBDBM50295785(CHEMBL552321 | N-(3-(dipropylamino)-2-hydroxypropo...)
Affinity DataEC50:  2.39E+4nM. Assay description: Transcriptional activation of HSF1 in heat shock stress-induced human HeLa cells assessed as granule formation treated 1 hr before heat shock challen...
In DepthDetails ArticlePubMed