BDBM50295895 3,4,5-trimethoxy-N-(6-(morpholinosulfonyl)benzo[d]thiazol-2-yl)benzamide::CHEMBL563047
SMILES COc1cc(cc(OC)c1OC)C(=O)Nc1nc2ccc(cc2s1)S(=O)(=O)N1CCOCC1
InChI Key InChIKey=BOQMKMYAQCBHSN-UHFFFAOYSA-N
Data  1 IC50
  Tab Delimited (TSV)   2D SDfile   Computed 3D by Vconf -m prep SDfile
Find this compound or compounds like it in BindingDB:
Activity Spreadsheet -- Enzyme Inhibition Constant Data from BindingDB
Found 1 hit for monomerid = 50295895
TargetReplicative DNA helicase(Staphylococcus aureus)
Microbiotix
Curated by ChEMBL
LigandPNGBDBM50295895(3,4,5-trimethoxy-N-(6-(morpholinosulfonyl)benzo[d]...)
Affinity DataIC50:  1.50E+4nM. Assay description: Inhibition of Staphylococcus aureus Smith DNA helicase DnaC assessed as strand unwinding after 30 mins by FRET assay
In DepthDetails ArticlePubMed