BDBM50295974 (3R,6S,7aS)-6-Amino-6-((S)-sec-butyl)-5-oxo-hexahydro-pyrrolo[2,1-b]thiazole-3-carbonitrile hydrochloride::CHEMBL563772
SMILES CC[C@H](C)[C@@]1(N)C[C@@H]2SC[C@@H](C#N)N2C1=O
InChI Key InChIKey=SVTPKDSKXXOAAJ-DKIAZLNASA-N
Data  2 IC50
  Tab Delimited (TSV)   2D SDfile   Computed 3D by Vconf -m prep SDfile
Find this compound or compounds like it in BindingDB:
Activity Spreadsheet -- Enzyme Inhibition Constant Data from BindingDB
Found 2 hits for monomerid = 50295974
TargetDipeptidyl peptidase 4(Homo sapiens (Human))
Phenomix
Curated by ChEMBL
LigandPNGBDBM50295974((3R,6S,7aS)-6-Amino-6-((S)-sec-butyl)-5-oxo-hexahy...)
Affinity DataIC50:  53nM. Assay description: Inhibition of human recombinant DPP4 by fluorescence assay
In DepthDetails ArticlePubMed
TargetProlyl endopeptidase FAP(Homo sapiens (Human))
Phenomix
Curated by ChEMBL
LigandPNGBDBM50295974((3R,6S,7aS)-6-Amino-6-((S)-sec-butyl)-5-oxo-hexahy...)
Affinity DataIC50: >1.00E+4nM. Assay description: Inhibition of human recombinant FAP expressed in Sf9 cells by fluorescence assay
In DepthDetails ArticlePubMed