BDBM50296053 1-butyl-6-methyl-3-(5-methylfuran-2-yl)-5,7-dioxo-1,5,6,7-tetrahydropyrimido[5,4-e][1,2,4]triazine 4-oxide::CHEMBL561125
SMILES CCCCn1nc(-c2ccc(C)o2)[n+]([O-])c2c1nc(=O)n(C)c2=O
InChI Key InChIKey=HOBFQPKNKRULRW-UHFFFAOYSA-N
Data  1 EC50
  Tab Delimited (TSV)   2D SDfile   Computed 3D by Vconf -m prep SDfile
Find this compound or compounds like it in BindingDB:
Activity Spreadsheet -- Enzyme Inhibition Constant Data from BindingDB
Found 1 hit for monomerid = 50296053
TargetHeat shock factor protein 1(Homo sapiens (Human))
Cytrx
Curated by ChEMBL
LigandPNGBDBM50296053(1-butyl-6-methyl-3-(5-methylfuran-2-yl)-5,7-dioxo-...)
Affinity DataEC50:  1.00E+4nM. Assay description: Amplification of HSF1 transcriptional activity in human heat shock-induced HeLa cells assessed as granule formation treated 1 hr before heat shock ch...
In DepthDetails ArticlePubMed