BDBM50296066 3-(benzo[d]thiazol-2-yl)-1-isopentyl-6-methylpyrimido[5,4-e][1,2,4]triazine-5,7(1H,6H)-dione::CHEMBL559039
SMILES CC(C)CCn1nc(nc2c1nc(=O)n(C)c2=O)-c1nc2ccccc2s1
InChI Key InChIKey=MYDWOGMGSXXIBZ-UHFFFAOYSA-N
Data  1 EC50
  Tab Delimited (TSV)   2D SDfile   Computed 3D by Vconf -m prep SDfile
Find this compound or compounds like it in BindingDB:
Activity Spreadsheet -- Enzyme Inhibition Constant Data from BindingDB
Found 1 hit for monomerid = 50296066
TargetHeat shock factor protein 1(Homo sapiens (Human))
Cytrx
Curated by ChEMBL
LigandPNGBDBM50296066(3-(benzo[d]thiazol-2-yl)-1-isopentyl-6-methylpyrim...)
Affinity DataEC50:  2.50E+3nM. Assay description: Amplification of HSF1 transcriptional activity in human heat shock-induced HeLa cells assessed as granule formation treated 1 hr before heat shock ch...
In DepthDetails ArticlePubMed