BDBM50296135 CHEMBL561322::N-(((S)-1-((R)-3-amino-4-(3-chlorophenyl)butanoyl)pyrrolidin-2-yl)methyl)benzenesulfonamide
SMILES N[C@@H](CC(=O)N1CCC[C@H]1CNS(=O)(=O)c1ccccc1)Cc1cccc(Cl)c1
InChI Key InChIKey=CIYSGOBBUFBQIH-MOPGFXCFSA-N
Data  4 IC50
  Tab Delimited (TSV)   2D SDfile   Computed 3D by Vconf -m prep SDfile
Find this compound or compounds like it in BindingDB:
Activity Spreadsheet -- Enzyme Inhibition Constant Data from BindingDB
Found 4 hits for monomerid = 50296135
TargetDipeptidyl peptidase 4(Homo sapiens (Human))
Santhera Pharmaceuticals (Switzerland)
Curated by ChEMBL
LigandPNGBDBM50296135(CHEMBL561322 | N-(((S)-1-((R)-3-amino-4-(3-chlorop...)
Affinity DataIC50:  8nM. Assay description: Inhibition of DPP4 by continuous fluorimetric assay
In DepthDetails ArticlePubMed
TargetDipeptidyl peptidase 9(Homo sapiens (Human))
Santhera Pharmaceuticals (Switzerland)
Curated by ChEMBL
LigandPNGBDBM50296135(CHEMBL561322 | N-(((S)-1-((R)-3-amino-4-(3-chlorop...)
Affinity DataIC50:  100nM. Assay description: Inhibition of DPP9 by continuous fluorimetric assay
In DepthDetails ArticlePubMed
TargetDipeptidyl peptidase 8(Homo sapiens (Human))
Santhera Pharmaceuticals (Switzerland)
Curated by ChEMBL
LigandPNGBDBM50296135(CHEMBL561322 | N-(((S)-1-((R)-3-amino-4-(3-chlorop...)
Affinity DataIC50:  200nM. Assay description: Inhibition of DPP8 by continuous fluorimetric assay
In DepthDetails ArticlePubMed
TargetDipeptidyl peptidase 2(Homo sapiens (Human))
Santhera Pharmaceuticals (Switzerland)
Curated by ChEMBL
LigandPNGBDBM50296135(CHEMBL561322 | N-(((S)-1-((R)-3-amino-4-(3-chlorop...)
Affinity DataIC50:  1.90E+4nM. Assay description: Inhibition of DPP7 by continuous fluorimetric assay
In DepthDetails ArticlePubMed